{"text_format":"1","workbook":"xlsx","n_sheets":21,"sheets":["Cover","User Guide","Map & Key","Model Design","Inputs >>","InpC","InpAct","Calcs >>","RCV","Totex","Wholesale","Reconciliation","Retail","Customers","Summary_Calc","Outputs >>","GraphData","Waterfall","QA >>","Track","Check"],"not_rendered":{"charts":2,"images":1,"macros":1,"external_links":2,"defined_names":58,"comments":0,"pivot_tables":0},"unopened":[{"sheet":"Waterfall","index":17,"reason":"not_a_worksheet"}],"bounds":{"document_bytes":16777216,"sheet_cells":100000,"rows_first":2000,"rows_last":500,"rows_between":2000,"halvings":0,"cell_chars":16384,"cell_head_chars":4096},"cells_cut":0,"cells_raw":0,"read":"whole","date_system":"1900"}

{"sheet":"Cover","index":0,"n_rows":44,"n_cols":7,"rows_kept":44,"cut":false,"hidden":false,"merged":[[39,3,39,4],[38,3,38,4],[7,3,7,4],[18,3,18,4],[35,3,35,4],[36,3,36,4],[37,3,37,4]]}
[{"$f":" RIGHT(CELL(\"filename\", $A$1), LEN(CELL(\"filename\", $A$1)) - SEARCH(\"]\", CELL(\"filename\", $A$1)))","v":"Cover"}]
[]
[null,null,"Model name:","PR19 Bill Movement Model"]
[null,null,"Version number:",{"$f":" LEFT(D5, FIND(\".\", D5, 1) - 1)","v":"Bill-Waterfall-Model-12c-for-publication"}]
[null,null,"Filename:",{"$f":" MID(CELL(\"filename\"), FIND(\"[\", CELL(\"filename\"), 1) + 1, FIND(\"]\", CELL(\"filename\"), 1) - FIND(\"[\", CELL(\"filename\"), 1) - 1)","v":"Bill-Waterfall-Model-12c-for-publication.xlsm"}]
[null,null,"Date:","2019-01-28"]
[null,null,"Author:","Ofwat"]
[null,null,"Author contact information:","pr19@ofwat.gsi.gov.uk"]
[]
[]
[null,null,"Summary of model:","The model calculates the movement in average residential bill (combined bill for WaSCs). "]
[null,null,null,"The model draws data automatically from the PR14 and PR19 models."]
[null,null,null,"This is the model referred to in Table 2.1 of the 'Company business plan presentation pro-forma'"]
[null,null,null,"Follow link to pro-forma >>",null,"https://www.ofwat.gov.uk/publication/company-business-plan-presentation-pro-forma/"]
[]
{"$rows_left_out":30}
{"sheet":"User Guide","index":1,"n_rows":76,"n_cols":5,"rows_kept":76,"cut":false,"hidden":false,"merged":[]}
[{"$f":" RIGHT(CELL(\"filename\", $A$1), LEN(CELL(\"filename\", $A$1)) - SEARCH(\"]\", CELL(\"filename\", $A$1)))","v":"User Guide"}]
[]
[null,"INTRODUCTION"]
[]
[null,null,null,null,"This model will create a waterfall chart showing the main components causing the movement in bills between PR14 and PR19."]
[]
[null,null,null,"INITIAL SET UP"]
[null,null,null,null,"The model will automatically pick up the correct input fields when you link it to the water company financial models. "]
[]
[null,null,null,null,"On first use of the model you will need to link to both the PR14 and PR19 financial models for your company."]
[null,null,null,"Step 1 - ","On the Excel menu click DATA / Edit Links"]
[null,null,null,"Step 2 - ","Select the link to the PR19 model and click \"Change Source\""]
[null,null,null,"Step 3 - ","Navigate to the correct PR19 financial model and select it."]
[null,null,null,"Step 4 - ","Select the link to the PR14 model and click \"Change Source\""]
[null,null,null,"Step 5 - ","Navigate to the correct PR14 financial model and select it"]
{"$rows_left_out":62}
{"sheet":"Map & Key","index":2,"n_rows":113,"n_cols":26,"rows_kept":113,"cut":false,"hidden":false,"merged":[]}
[{"$f":" RIGHT(CELL(\"filename\", $A$1), LEN(CELL(\"filename\", $A$1)) - SEARCH(\"]\", CELL(\"filename\", $A$1)))","v":"Map & Key"}]
[]
["TABLE OF CONTENTS"]
[]
[null,null,null,null,null,"Table of Contents"]
[]
[null,null,null,null,null,null,null,"DOCUMENTATION",null,null,null,"MODEL INPUTS",null,null,null,null,"MODEL CALCULATIONS",null,null,null,null,"MODEL OUTPUTS",null,null,null,"MODEL QA"]
[]
[null,null,null,null,null,null,null,"Cover",null,null,null,"InpC",null,null,null,null,"RCV",null,null,null,null,"GraphData",null,null,null,"Track"]
[null,null,null,null,null,null,null,"Model cover sheet",null,null,null,"Constants",null,null,null,null,"Change due to RCV, WACC and run-off",null,null,null,null,"Table of bill movements",null,null,null,"Model changes and track records"]
[]
[null,null,null,null,null,null,null,"User Guide",null,null,null,"InpAct",null,null,null,null,"Totex",null,null,null,null,"Waterfall",null,null,null,"Check"]
[null,null,null,null,null,null,null,"Explanation of setup and macros",null,null,null,"All inputs to be flowed into model",null,null,null,null,"Change due to PAYG Totex and rate",null,null,null,null,"Graph of bill movements",null,null,null,"Checks"]
[]
[null,null,null,null,null,null,null,"Map & Key",null,null,null,null,null,null,null,null,"Wholesale"]
{"$rows_left_out":99}
{"sheet":"Model Design","index":3,"n_rows":122,"n_cols":24,"rows_kept":122,"cut":false,"hidden":false,"merged":[[101,11,101,16],[102,11,102,16],[107,7,107,10],[108,7,108,10],[109,7,109,10],[101,7,101,10],[102,7,102,10],[103,7,103,10],[104,7,104,10],[105,7,105,10],[111,7,111,10],[103,11,103,16],[104,11,104,16],[105,11,105,16],[106,11,106,16],[107,11,107,16],[108,11,108,16],[109,11,109,16],[110,11,110,16],[111,11,111,16],[106,7,106,10],[110,7,110,10],[111,17,111,27],[101,17,101,27],[102,17,102,27],[103,17,103,27],[104,17,104,27],[105,17,105,27],[106,17,106,27],[107,17,107,27],[108,17,108,27],[109,17,109,27],[110,17,110,27]]}
[{"$f":" RIGHT(CELL(\"filename\", $A$1), LEN(CELL(\"filename\", $A$1)) - SEARCH(\"]\", CELL(\"filename\", $A$1)))","v":"Model Design"}]
[]
["GENERAL MODEL DESIGN"]
[]
[null,null,null,null,null,"Structure of a residential bill"]
[]
[]
[]
[]
[]
[]
[]
[]
[]
[]
{"$rows_left_out":108}
{"sheet":"Inputs >>","index":4,"n_rows":0,"n_cols":0,"rows_kept":0,"cut":false,"hidden":false,"merged":[]}

{"sheet":"InpC","index":5,"n_rows":61,"n_cols":10,"rows_kept":61,"cut":false,"hidden":false,"merged":[]}
[{"$f":" RIGHT(CELL(\"FILENAME\", $A$1), LEN(CELL(\"FILENAME\", $A$1)) - SEARCH(\"]\", CELL(\"FILENAME\", $A$1)))","v":"InpC"}]
[]
[]
[]
[null,null,null,null,null,"Constant","Unit","Value",null,"Note"]
[]
["NON CHANGEABLE INPUTS"]
[]
[null,null,null,null,"Track Tolerance Level",1E-3,"tolerance"]
[null,null,null,null,"Check Tolerance Level",9.9999999999999995E-8,"tolerance"]
[]
[null,null,null,null,"Thousands in a million",1000,"thousand"]
[]
["TIME"]
[]
{"$rows_left_out":47}
{"sheet":"InpAct","index":6,"n_rows":373,"n_cols":11,"rows_kept":373,"cut":false,"hidden":false,"merged":[]}
[{"$f":" RIGHT(CELL(\"FILENAME\", $A$1), LEN(CELL(\"FILENAME\", $A$1)) - SEARCH(\"]\", CELL(\"FILENAME\", $A$1)))","v":"InpAct"}]
[]
[]
[]
[null,null,null,null,null,"Constant","Unit","Active Value","Override","Linked Value","Note"]
[]
["BILL"]
[]
[null,"Retail allowed revenue per customer: joint services"]
[null,null,null,{"$f":"InpC!$F$26","v":"PR14"},{"$f":"'[2]Exec Summary'!E$38","v":"Average water-only bill"},null,"£",{"$f":" IF(I10 <> \"\", I10, J10)","v":129.34471124729475},null,{"$f":"'[2]Exec Summary'!N$38","v":129.34471124729475}]
[null,null,null,{"$f":"InpC!$F$26","v":"PR14"},{"$f":"'[2]Exec Summary'!E$41","v":"Average wastewater-only bill"},null,"£",{"$f":" IF(I11 <> \"\", I11, J11)","v":0},null,{"$f":"'[2]Exec Summary'!N$41","v":0}]
[]
[null,null,null,{"$f":"InpC!$F$27","v":"PR19"},{"$f":"[1]Summary_Calc!E$1154","v":"Wholesale wastewater network allowed revenue (excluding capital connection charges, other income and operating income) per residential customer - adj - real"},{"$f":"[1]Summary_Calc!F$1154","v":0},{"$f":"[1]Summary_Calc!G$1154","v":"£"},{"$f":" IF(I13 <> \"\", I13, J13)","v":127.54348056337115},null,{"$f":"[1]Summary_Calc!P$1163","v":127.54348056337115}]
[null,null,null,{"$f":"InpC!$F$27","v":"PR19"},{"$f":"[1]Summary_Calc!E$1168","v":0},{"$f":"[1]Summary_Calc!F$1168","v":0},{"$f":"[1]Summary_Calc!G$1168","v":0},{"$f":" IF(I14 <> \"\", I14, J14)","v":0},null,{"$f":"[1]Summary_Calc!P$1177","v":0}]
[]
{"$rows_left_out":359}
{"sheet":"Calcs >>","index":7,"n_rows":0,"n_cols":0,"rows_kept":0,"cut":false,"hidden":false,"merged":[]}

{"sheet":"RCV","index":8,"n_rows":558,"n_cols":10,"rows_kept":558,"cut":false,"hidden":false,"merged":[]}
[{"$f":" RIGHT(CELL(\"filename\", $A$1), LEN(CELL(\"filename\", $A$1)) - SEARCH(\"]\", CELL(\"filename\", $A$1)))","v":"RCV"},null,null,null,null,{"$f":"Check!F2","v":-3},"Error chks"]
[null,null,null,null,null,{"$f":"Check!F3","v":62},"Track checks"]
[]
[]
[null,null,null,null,null,"Constant","Unit","Value",null,"Note"]
[]
["WHOLESALE: Change in bill due to change in RCV DEPRECIATION"]
[]
[null,"This section calculates the components causing the change in RCV depreciation"]
[null,"Water"]
[]
[null,null,{"$f":"InpC!$F$26","v":"PR14"}]
[null,null,null,{"$f":"InpC!D$55","v":"PR14"},{"$f":"InpC!E$55","v":"Adjustment from 2012/13 year average RPI to 2017/18 year average CPIH deflated"},{"$f":"InpC!F$55","v":1.1050198504351716},{"$f":"InpC!G$55","v":"factor"},{"$f":"InpC!H$55","v":0}]
[null,null,null,{"$f":"InpAct!D$108","v":"PR14"},{"$f":"InpAct!E$108","v":"RCV as at 2015 - real - water"},{"$f":"InpAct!F$108","v":0},{"$f":"InpAct!G$108","v":"£m"},{"$f":"InpAct!H$108","v":242.63624315792703}]
[null,null,null,{"$f":"InpC!$F$26","v":"PR14"},"RCV as at 2015 - 2017/18 year average CPIH deflated - water",null,"£m",{"$f":"H14 * $F13","v":268.11786512452443}]
{"$rows_left_out":544}
{"sheet":"Totex","index":9,"n_rows":161,"n_cols":10,"rows_kept":161,"cut":false,"hidden":false,"merged":[]}
[{"$f":" RIGHT(CELL(\"filename\", $A$1), LEN(CELL(\"filename\", $A$1)) - SEARCH(\"]\", CELL(\"filename\", $A$1)))","v":"Totex"},null,null,null,null,{"$f":"Check!F2","v":-3},"Error chks"]
[null,null,null,null,null,{"$f":"Check!F3","v":62},"Track checks"]
[]
[]
[null,null,null,null,null,"Constant","Unit","Value",null,"Note"]
[]
["WHOLESALE: Change in bill due to change in PAYG TOTEX"]
[]
[null,"This section calculates the components causing the change in PAYG Totex"]
[null,"Water"]
[]
[null,null,"PR14"]
[null,null,null,{"$f":"InpC!D$55","v":"PR14"},{"$f":"InpC!E$55","v":"Adjustment from 2012/13 year average RPI to 2017/18 year average CPIH deflated"},{"$f":"InpC!F$55","v":1.1050198504351716},{"$f":"InpC!G$55","v":"factor"},{"$f":"InpC!H$55","v":0}]
[null,null,null,{"$f":" InpAct!D$87","v":"PR14"},{"$f":" InpAct!E$87","v":"Totex - real - Water"},{"$f":" InpAct!F$87","v":0},{"$f":" InpAct!G$87","v":"£m"},{"$f":" InpAct!H$87","v":78.482413302341087}]
[null,null,null,{"$f":"InpC!$F$26","v":"PR14"},"Totex - 2017/18 year average CPIH deflated - Water",null,"£m",{"$f":"H14 * $F13","v":86.724624609144271}]
{"$rows_left_out":147}
{"sheet":"Wholesale","index":10,"n_rows":67,"n_cols":10,"rows_kept":67,"cut":false,"hidden":false,"merged":[]}
[{"$f":" RIGHT(CELL(\"filename\", $A$1), LEN(CELL(\"filename\", $A$1)) - SEARCH(\"]\", CELL(\"filename\", $A$1)))","v":"Wholesale"},null,null,null,null,{"$f":"Check!F2","v":-3},"Error chks"]
[null,null,null,null,null,{"$f":"Check!F3","v":62},"Track checks"]
[]
[]
[null,null,null,null,null,"Constant","Unit","Value",null,"Note"]
[]
["WHOLESALE: Change in bill due to change in OTHER ITEMS"]
[]
[null,"Change in revenue re-profiling"]
[null,null,null,{"$f":"InpAct!D$48","v":"PR14"},{"$f":"InpAct!E$48","v":"Revenue requirement including tax charge - real - water"},{"$f":"InpAct!F$48","v":0},{"$f":"InpAct!G$48","v":"£m"},{"$f":"InpAct!H$48","v":89.336070388084977}]
[null,null,null,{"$f":"InpAct!D$49","v":"PR14"},{"$f":"InpAct!E$49","v":"Phase 9: Re-profiled allowed revenue - real - water"},{"$f":"InpAct!F$49","v":0},{"$f":"InpAct!G$49","v":"£m"},{"$f":"InpAct!H$49","v":89.336070388084977}]
[null,null,null,{"$f":"InpC!$F$26","v":"PR14"},"Impact of re-profiling of revenue requirement - real - water",null,"£m",{"$f":" H11 - H10","v":0}]
[]
[null,null,null,{"$f":"InpAct!D$50","v":"PR14"},{"$f":"InpAct!E$50","v":"Revenue requirement including tax charge - real - wastewater"},{"$f":"InpAct!F$50","v":0},{"$f":"InpAct!G$50","v":"£m"},{"$f":"InpAct!H$50","v":0}]
[null,null,null,{"$f":"InpAct!D$51","v":"PR14"},{"$f":"InpAct!E$51","v":"Phase 9: Re-profiled allowed revenue - real - wastewater"},{"$f":"InpAct!F$51","v":0},{"$f":"InpAct!G$51","v":"£m"},{"$f":"InpAct!H$51","v":0}]
{"$rows_left_out":53}
{"sheet":"Reconciliation","index":11,"n_rows":69,"n_cols":10,"rows_kept":69,"cut":false,"hidden":false,"merged":[]}
[{"$f":" RIGHT(CELL(\"filename\", $A$1), LEN(CELL(\"filename\", $A$1)) - SEARCH(\"]\", CELL(\"filename\", $A$1)))","v":"Reconciliation"},null,null,null,null,{"$f":"Check!F2","v":-3},"Error chks"]
[null,null,null,null,null,{"$f":"Check!F3","v":62},"Track checks"]
[]
[]
[null,null,null,null,null,"Constant","Unit","Value",null,"Note"]
[]
["WHOLESALE: Change in bill due to change in RECONCILIATION ITEMS"]
[]
[null,"Sum the PR14 wholesale reconciliation items (there are no retail reconciliation items for PR14)"]
[null,null,null,{"$f":"InpC!D$55","v":"PR14"},{"$f":"InpC!E$55","v":"Adjustment from 2012/13 year average RPI to 2017/18 year average CPIH deflated"},{"$f":"InpC!F$55","v":1.1050198504351716},{"$f":"InpC!G$55","v":"factor"},{"$f":"InpC!H$55","v":0}]
[null,null,null,{"$f":"InpAct!D318","v":"PR14"},{"$f":"InpAct!E318","v":"SIM adjustment (+ or -) - real - Water"},{"$f":"InpAct!F318","v":0},{"$f":"InpAct!G318","v":"£m"},{"$f":"InpAct!H318","v":0.56621992179475}]
[null,null,null,{"$f":"InpAct!D319","v":"PR14"},{"$f":"InpAct!E319","v":"Opex incentive allowance (+ only) - real - Water"},{"$f":"InpAct!F319","v":0},{"$f":"InpAct!G319","v":"£m"},{"$f":"InpAct!H319","v":0}]
[null,null,null,{"$f":"InpAct!D320","v":"PR14"},{"$f":"InpAct!E320","v":"CIS adjustment (+ or -) - real - Water"},{"$f":"InpAct!F320","v":0},{"$f":"InpAct!G320","v":"£m"},{"$f":"InpAct!H320","v":0}]
[null,null,null,{"$f":"InpAct!D321","v":"PR14"},{"$f":"InpAct!E321","v":"RCM adjustment (+ or -) - real - Water"},{"$f":"InpAct!F321","v":0},{"$f":"InpAct!G321","v":"£m"},{"$f":"InpAct!H321","v":2.4372300892439598}]
[null,null,null,{"$f":"InpAct!D322","v":"PR14"},{"$f":"InpAct!E322","v":"Equity injection clawback (- only) - real - Water"},{"$f":"InpAct!F322","v":0},{"$f":"InpAct!G322","v":"£m"},{"$f":"InpAct!H322","v":0}]
{"$rows_left_out":55}
{"sheet":"Retail","index":12,"n_rows":27,"n_cols":10,"rows_kept":27,"cut":false,"hidden":false,"merged":[]}
[{"$f":" RIGHT(CELL(\"filename\", $A$1), LEN(CELL(\"filename\", $A$1)) - SEARCH(\"]\", CELL(\"filename\", $A$1)))","v":"Retail"},null,null,null,null,{"$f":"Check!F2","v":-3},"Error chks"]
[null,null,null,null,null,{"$f":"Check!F3","v":62},"Track checks"]
[]
[]
[null,null,null,null,null,"Constant","Unit","Value",null,"Note"]
[]
["RETAIL: Change in bill due to change in COST TO SERVE"]
[]
[null,"Change in bill due to change in retail CTS"]
[]
[null,"Note: In the PR14 model wholesale prices are indexed but retail prices are not indexed."]
[null,null,null,null,{"$f":"InpC!E$36","v":"Company type switch"},{"$f":"InpC!F$36","v":1},{"$f":"InpC!G$36","v":"0 = WaSC, 1 = WoC "}]
[null,null,null,{"$f":"InpAct!D$35","v":"PR14"},{"$f":"InpAct!E$35","v":"Retail allowed revenue per customer: single service"},{"$f":"InpAct!F$35","v":0},{"$f":"InpAct!G$35","v":"£"},{"$f":"InpAct!H$35","v":25.170480967789604}]
[null,null,null,{"$f":"InpAct!D$36","v":"PR14"},{"$f":"InpAct!E$36","v":"Retail allowed revenue per customer: joint services"},{"$f":"InpAct!F$36","v":0},{"$f":"InpAct!G$36","v":"£"},{"$f":"InpAct!H$36","v":0}]
[null,null,null,{"$f":"InpC!$F$26","v":"PR14"},"Retail allowed revenue per customer",null,"£",{"$f":" IF(F$12 = 1, H13, H14)","v":25.170480967789604}]
{"$rows_left_out":13}
{"sheet":"Customers","index":13,"n_rows":149,"n_cols":10,"rows_kept":149,"cut":false,"hidden":false,"merged":[]}
[{"$f":" RIGHT(CELL(\"filename\", $A$1), LEN(CELL(\"filename\", $A$1)) - SEARCH(\"]\", CELL(\"filename\", $A$1)))","v":"Customers"},null,null,null,null,{"$f":"Check!F2","v":-3},"Error chks"]
[null,null,null,null,null,{"$f":"Check!F3","v":62},"Track checks"]
[]
[]
[null,null,null,null,null,"Constant","Unit","Value",null,"Note"]
[]
["WHOLESALE: Change in bill due to change in CUSTOMER NUMBERS and APPORTIONMENT"]
[]
[null,"Change in bill due to change in customer numbers"]
[null,"This section calculates the PR14 customer numbers and indexes the allowed revenue"]
[null,null,{"$f":"InpC!$F$26","v":"PR14"}]
[null,null,null,{"$f":"InpAct!D$22","v":"PR14"},{"$f":"InpAct!E$22","v":"Households connected for water and wastewater - unmetered"},{"$f":"InpAct!F$22","v":0},{"$f":"InpAct!G$22","v":"000s"},{"$f":"InpAct!H$22","v":0}]
[null,null,null,{"$f":"InpAct!D$23","v":"PR14"},{"$f":"InpAct!E$23","v":"Households connected for water and wastewater - metered"},{"$f":"InpAct!F$23","v":0},{"$f":"InpAct!G$23","v":"000s"},{"$f":"InpAct!H$23","v":0}]
[null,null,null,{"$f":"InpC!$F$26","v":"PR14"},"Total households - Water & Wastewater",null,"000s",{"$f":"SUM(H12:H13)","v":0}]
[]
{"$rows_left_out":135}
{"sheet":"Summary_Calc","index":14,"n_rows":121,"n_cols":10,"rows_kept":121,"cut":false,"hidden":false,"merged":[]}
[{"$f":" RIGHT(CELL(\"filename\", $A$1), LEN(CELL(\"filename\", $A$1)) - SEARCH(\"]\", CELL(\"filename\", $A$1)))","v":"Summary_Calc"},null,null,null,null,{"$f":"Check!F2","v":-3},"Error chks"]
[null,null,null,null,null,{"$f":"Check!F3","v":62},"Track checks"]
[]
[]
[null,null,null,null,null,"Constant","Unit","Value",null,"Note"]
[]
["SUMMARY OF COMPONENTS CAUSING CHANGE IN BILL"]
[]
[null,"Note: In the PR14 model wholesale prices are indexed but retail prices are not indexed."]
[null,"Deflate the wholesale allowed revenue, then add to the real retail allowed revenue to calculate the combined bill"]
[null,null,null,{"$f":"InpC!D$55","v":"PR14"},{"$f":"InpC!E$55","v":"Adjustment from 2012/13 year average RPI to 2017/18 year average CPIH deflated"},{"$f":"InpC!F$55","v":1.1050198504351716},{"$f":"InpC!G$55","v":"factor"},{"$f":"InpC!H$55","v":0}]
[null,null,null,{"$f":"InpAct!D$45","v":"PR14"},{"$f":"InpAct!E$45","v":"Wholesale water allowed revenue per customer excluding capital connection charges, other income and operating income"},{"$f":"InpAct!F$45","v":0},{"$f":"InpAct!G$45","v":"£"},{"$f":"InpAct!H$45","v":104.17423027950514}]
[null,null,null,{"$f":"InpC!$F$26","v":"PR14"},"Wholesale water allowed revenue per customer - 2017/18 year average CPIH deflated",null,"£",{"$f":" H12 * $F11","v":115.11459236265789}]
[]
[null,null,null,{"$f":"InpC!D$55","v":"PR14"},{"$f":"InpC!E$55","v":"Adjustment from 2012/13 year average RPI to 2017/18 year average CPIH deflated"},{"$f":"InpC!F$55","v":1.1050198504351716},{"$f":"InpC!G$55","v":"factor"},{"$f":"InpC!H$55","v":0}]
{"$rows_left_out":107}
{"sheet":"Outputs >>","index":15,"n_rows":0,"n_cols":0,"rows_kept":0,"cut":false,"hidden":false,"merged":[]}

{"sheet":"GraphData","index":16,"n_rows":36,"n_cols":13,"rows_kept":36,"cut":false,"hidden":false,"merged":[]}
[{"$f":" RIGHT(CELL(\"filename\", $A$1), LEN(CELL(\"filename\", $A$1)) - SEARCH(\"]\", CELL(\"filename\", $A$1)))","v":"GraphData"}]
[]
[]
[null,null,null,null,"[Do not insert rows or columns anywhere on this sheet]"]
[]
[]
["DATA FOR BRIDGE CHART"]
[]
[null,"Price base is 2017/18 year average CPIH deflated"]
[]
[null,"Change in average residential bill (combined for WaSCs), £"]
[null,null,null,null,null,null,"Values","Ends","Blank","Up > 0","Up <0","Down > 0","Down < 0"]
[null,null,null,null,null,"2019/20 average residential bill",{"$f":"Summary_Calc!H24","v":140.28507333044749},{"$f":"G13","v":140.28507333044749}]
[null,null,null,null,{"$f":"Summary_Calc!E108","v":"Change in RCV"},{"$f":"RIGHT(E14, LEN(E14) - 10)","v":"RCV"},{"$f":"Summary_Calc!H108","v":7.1409038841290409},null,{"$f":"MAX(0,MIN(SUM(G$13:G13),SUM(G$13:G14)))+MIN(0,MAX(SUM(G$13:G13),SUM(G$13:G14)))","v":140.28507333044749},{"$f":"MAX(0,MIN(SUM(G$13:G14),G14))","v":7.1409038841290409},{"$f":"-MAX(0,G14-J14)","v":0},{"$f":"MAX(0,M14-G14)","v":0},{"$f":"MIN(0,MAX(SUM(G$13:G14),G14))","v":0}]
[null,null,null,null,{"$f":"Summary_Calc!E109","v":"Change in Totex"},"Totex",{"$f":"Summary_Calc!H109","v":6.9626051030741731},null,{"$f":"MAX(0,MIN(SUM(G$13:G14),SUM(G$13:G15)))+MIN(0,MAX(SUM(G$13:G14),SUM(G$13:G15)))","v":147.42597721457653},{"$f":"MAX(0,MIN(SUM(G$13:G15),G15))","v":6.9626051030741731},0,0,{"$f":"MIN(0,MAX(SUM(G$13:G15),G15))","v":0}]
{"$rows_left_out":22}
{"sheet":"QA >>","index":18,"n_rows":0,"n_cols":0,"rows_kept":0,"cut":false,"hidden":false,"merged":[]}

{"sheet":"Track","index":19,"n_rows":129,"n_cols":15,"rows_kept":129,"cut":false,"hidden":false,"merged":[]}
[{"$f":" RIGHT(CELL(\"filename\", $A$1), LEN(CELL(\"filename\", $A$1)) - SEARCH(\"]\", CELL(\"filename\", $A$1)))","v":"Track"},null,null,null,null,null,null,null,null,null,null,null,"do not del col",null,"do not del col"]
[null,null,null,null,null,{"$f":"Check!$F$2","v":-3},"Checks",null,null,{"$f":" SUM(J7:J119)","v":62}]
[null,null,null,null,null,{"$f":"J2","v":62},"Track chgs"]
[]
[null,null,null,null,null,null,"Unit",null,null,{"$f":" MATCH($H$6, M6:O6, 0)","v":2},"Difference","Diff %"]
[null,null,null,null,"Comparison column label",null,null,"Nil inputs",null,null,null,null,null,"Nil inputs"]
[null,null,null,null,"[do not delete row]"]
["INPUTS"]
[]
[null,null,"Retail"]
[null,null,null,{"$f":"InpAct!D$38","v":"PR19"},{"$f":"InpAct!E$38","v":"Residentials connected for water or sewerage"},{"$f":"InpAct!F$38","v":0},{"$f":"InpAct!G$38","v":"000s"},{"$f":"InpAct!H$38","v":16.770830288728732},null,{"$f":" IF(ABS(K11) > InpC!$F$9, 1, 0)","v":1},{"$f":" H11 - INDEX(M11:O11, $J$5)","v":16.770830288728732},{"$f":" IF(ABS(K11) > InpC!$F$9, IF(INDEX(M11:O11, $J$5) = 0, 0, H11 / INDEX(M11:O11, $J$5) - 1), 0)","v":0},null,0]
[null,null,null,null,null,null,null,null,null,{"$f":" IF(ABS(K12) > InpC!$F$9, 1, 0)","v":0},0,{"$f":" IF(ABS(K12) > InpC!$F$9, IF(INDEX(M12:O12, $J$5) = 0, 0, H12 / INDEX(M12:O12, $J$5) - 1), 0)","v":0},null,0]
[null,null,"Customer Numbers and apportionment",null,null,null,null,null,null,{"$f":" IF(ABS(K13) > InpC!$F$9, 1, 0)","v":0},0,{"$f":" IF(ABS(K13) > InpC!$F$9, IF(INDEX(M13:O13, $J$5) = 0, 0, H13 / INDEX(M13:O13, $J$5) - 1), 0)","v":0},null,0]
[null,null,null,{"$f":"InpAct!D$28","v":"PR19"},{"$f":"InpAct!E28","v":"Households connected for water only - unmetered"},{"$f":"InpAct!F28","v":0},{"$f":"InpAct!G28","v":"000s"},{"$f":"InpAct!H28","v":321.30230526911606},null,{"$f":" IF(ABS(K14) > InpC!$F$9, 1, 0)","v":1},321.30230526911606,{"$f":" IF(ABS(K14) > InpC!$F$9, IF(INDEX(M14:O14, $J$5) = 0, 0, H14 / INDEX(M14:O14, $J$5) - 1), 0)","v":0},null,0]
[null,null,null,{"$f":"InpAct!D$25","v":"PR19"},{"$f":"InpAct!E25","v":"Households connected for water only - metered"},{"$f":"InpAct!F25","v":0},{"$f":"InpAct!G25","v":"000s"},{"$f":"InpAct!H25","v":410.94896195686044},null,{"$f":" IF(ABS(K15) > InpC!$F$9, 1, 0)","v":1},410.94896195686044,{"$f":" IF(ABS(K15) > InpC!$F$9, IF(INDEX(M15:O15, $J$5) = 0, 0, H15 / INDEX(M15:O15, $J$5) - 1), 0)","v":0},null,0]
{"$rows_left_out":115}
{"sheet":"Check","index":20,"n_rows":33,"n_cols":7,"rows_kept":33,"cut":false,"hidden":false,"merged":[]}
[{"$f":" RIGHT(CELL(\"filename\", $A$1), LEN(CELL(\"filename\", $A$1)) - SEARCH(\"]\", CELL(\"filename\", $A$1)))","v":"Check"}]
[null,null,null,null,null,{"$f":"F11","v":-3},"Checks"]
[null,null,null,null,null,{"$f":"F30","v":62},"Track chgs"]
[]
[null,null,null,null,null,"Constant","Unit"]
[]
["CHECK SUMMARY"]
[]
["MODEL INTEGRITY CHECKS"]
[]
[null,null,null,null,"Total model integrity checks",{"$f":" SUM(F15:F26)","v":-3}]
[]
[null,null,null,null,"[do not delete row]"]
[]
[null,"General",null,null,{"$f":"InpC!$E$38","v":"Company Type switch check"},{"$f":"InpC!F38","v":0}]
{"$rows_left_out":18}